{"text_format":"1","workbook":"xlsx","n_sheets":4,"sheets":["Lízing kalkuláció","\"\"","kalkulációs feltételek","segéd"],"not_rendered":{"charts":0,"images":0,"macros":1,"external_links":0,"defined_names":8,"comments":0,"pivot_tables":0},"unopened":[],"bounds":{"document_bytes":16777216,"sheet_cells":100000,"rows_first":2000,"rows_last":500,"rows_between":2000,"halvings":0,"cell_chars":16384,"cell_head_chars":4096},"cells_cut":0,"cells_raw":0,"read":"whole","date_system":"1900"}

{"sheet":"Lízing kalkuláció","index":0,"n_rows":339,"n_cols":7,"rows_kept":339,"cut":false,"hidden":false,"merged":[[31,1,31,2],[32,1,32,2],[33,1,33,2],[29,1,29,2],[15,1,15,2],[16,1,16,2],[18,1,18,2],[19,1,19,2],[20,1,20,2],[21,1,21,2],[22,1,22,2],[23,1,23,2],[25,1,25,3],[17,1,17,2],[28,1,28,2],[1,1,1,3],[26,1,26,2],[27,1,27,2],[0,5,0,8],[1,5,12,8],[3,1,3,2],[4,1,4,2],[14,1,14,3],[5,1,5,2],[7,1,7,2],[9,1,9,2],[10,1,10,2],[11,1,11,2]]}
[null,"Arthur Bergmann Lízing Zrt. - lakáslízing kalkulátor",null,null,null,"Használati útmutató:"]
[null,"IGÉNYELT LÍZING PARAMÉTEREI",null,null,null,"A kékkel keretezett fehér cellák szerkeszthetők. \n\nFINANSZÍROZÁS ÖSSZEGÉNEK MEGADÁSA: A saját erő %-os VAGY Ft összegének megadásával lehetséges. Ha mindkét mező ki van töltve, akkor a %-os saját erő alapján számítja a finanszírozott összeget és piros felkiáltójel jelzi, ha az igényelt %-os érték nincs összhangban az igényelt Ft összeggel.\n\nVISSZLÍZING: X-el jelölendő. Visszlízing esetén \naz ingatlan vételára = finanszírozott összeg, a saját erőt üresen kell hagyni, vagy 0-ra állítani.\n\nHa a megadott érték piros, akkor nem felel meg a terméknek, ekkor az ajánlat automatikusan a termékleírás szerinti korlátot tartalmazza az \"AJÁNLAT PARAMÉTEREI\" alatt. \n\nHa a \"Havi lízingdíj\" mellett a \"Kalkuláció szükséges!\" felirat látható, meg kell nyomni a \"Kalkuláció!\" gombot."]
[null,"VISSZLÍZING?"]
[null,"Ingatlan vételára",null,30000000]
[null,"Saját erő%"]
[null,"Saját erő Ft",null,10000000,{"$f":"'\"\"'!E6","v":""}]
[]
[null,"Igényelt finanszírozás összege",null,{"$f":"'\"\"'!D8","v":20000000}]
[]
[null,"Futamidő (év)",null,20]
[null,"Maradványérték %",null,0.1]
[null,"Maradványérték Ft",null,{"$f":"'\"\"'!D12","v":2000000}]
[]
[null,"Arthur Bergmann Lízing Zrt."]
[null,"LAKÁSLÍZING AJÁNLAT PARAMÉTEREI",null,null,"Termékleírásban szereplő korlátok:"]
[null,"Ingatlan vételára",null,{"$f":"'\"\"'!D16","v":30000000},"minimum 14.300.000 Ft"]
[null,"Saját erő %",null,{"$f":"'\"\"'!D17","v":0.33333333333333331},"minimum 30%, visszlízingnél 0"]
[null,"Saját erő Ft",null,{"$f":"'\"\"'!D18","v":10000000}]
[null,"Lízing finanszírozás összege",null,{"$f":"'\"\"'!D19","v":20000000.000000004},"minimum 10.000.000 Ft"]
[null,"Maradványérték %",null,{"$f":"'\"\"'!D20","v":0.1},"10 évig maximum 30%, 15 évig maximum 20%, 20 évig maximum 10%"]
[null,"Maradványérték összege",null,{"$f":"'\"\"'!D21","v":2000000.0000000005}]
[null,"Éves kamatláb*",null,{"$f":"'\"\"'!D22","v":9.1999999999999998E-2},{"$f":"'kalkulációs feltételek'!A2","v":"2021-08-02"},"-án érvényes 1 havi BUBOR alapján"]
[null,"Futamidő években",null,{"$f":"'\"\"'!D23","v":20}]
[null,"Tervezett folyósítás",null,{"$f":"'\"\"'!D24","v":"2021-09-10"},"ajánlat érvényességi dátuma"]
[]
[null,"LÍZING ÁTTEKINTŐ"]
[null,"Havi lízingdíj",null,{"$f":"D38","v":173408.62283356127},{"$f":"IF(segéd!B3=0,\"\",\"Kalkuláció szükséges!\")","v":"Kalkuláció szükséges!"}]
[null,"Törlesztések száma",null,{"$f":"'\"\"'!D28","v":240}]
[null,"Kamat összesen",null,{"$f":"'\"\"'!D29","v":27110366.236864347}]
[null,"Futamidő alatt megfizetett lízingdíjak összege",null,{"$f":"'\"\"'!D30","v":43618069.480054855}]
[null,"Induláskor fizetendő díjak:"]
[null,"Szerződéskötés díj",null,{"$f":"'\"\"'!D31","v":400000.00000000006},"2%, alapja a finanszírozási összeg"]
[null,"Szerződéskötéskor fizetendő illeték",null,{"$f":"'\"\"'!D32","v":600000},"2%, alapja az ingatlan vételára"]
[null,"Ügyvédi díj",null,{"$f":"'\"\"'!D33","v":150000},"0,5%, minimum 100.000 Ft, alapja az ingatlan vételára"]
[null,"Értékbecslés és közokirat díja egyedi díjszabás alapján"]
[]
[null,"Esedékesség dátuma","Nyitó tőketartozás összege","Esedékes lízingdíj (és maradványérték)","Lízingdíj tőkerésze","Lízingdíjban foglalt kamat összege","Záró tőketartozás a befizetést követően"]
[{"$f":"'\"\"'!A38","v":1},{"$f":"'\"\"'!B38","v":"2021-09-15"},{"$f":"'\"\"'!C38","v":20000000.000000004},173408.62283356127,{"$f":"'\"\"'!E38","v":148283.50478361448},{"$f":"'\"\"'!F38","v":25125.118049946774},{"$f":"'\"\"'!G38","v":19851716.495216388}]
[{"$f":"'\"\"'!A39","v":2},{"$f":"'\"\"'!B39","v":"2021-10-15"},{"$f":"'\"\"'!C39","v":19851716.495216388},{"$f":"'\"\"'!D39","v":173408.62283356127},{"$f":"'\"\"'!E39","v":23304.875402432139},{"$f":"'\"\"'!F39","v":150103.74743112913},{"$f":"'\"\"'!G39","v":19828411.619813956}]
[{"$f":"'\"\"'!A40","v":3},{"$f":"'\"\"'!B40","v":"2021-11-15"},{"$f":"'\"\"'!C40","v":19828411.619813956},{"$f":"'\"\"'!D40","v":173408.62283356127},{"$f":"'\"\"'!E40","v":18464.028495214327},{"$f":"'\"\"'!F40","v":154944.59433834694},{"$f":"'\"\"'!G40","v":19809947.591318741}]
[{"$f":"'\"\"'!A41","v":4},{"$f":"'\"\"'!B41","v":"2021-12-15"},{"$f":"'\"\"'!C41","v":19809947.591318741},{"$f":"'\"\"'!D41","v":173408.62283356127},{"$f":"'\"\"'!E41","v":23620.700434622093},{"$f":"'\"\"'!F41","v":149787.92239893918},{"$f":"'\"\"'!G41","v":19786326.89088412}]
[{"$f":"'\"\"'!A42","v":5},{"$f":"'\"\"'!B42","v":"2022-01-15"},{"$f":"'\"\"'!C42","v":19786326.89088412},{"$f":"'\"\"'!D42","v":173408.62283356127},{"$f":"'\"\"'!E42","v":18792.889998440165},{"$f":"'\"\"'!F42","v":154615.7328351211},{"$f":"'\"\"'!G42","v":19767534.00088568}]
[{"$f":"'\"\"'!A43","v":6},{"$f":"'\"\"'!B43","v":"2022-02-15"},{"$f":"'\"\"'!C43","v":19767534.00088568},{"$f":"'\"\"'!D43","v":173408.62283356127},{"$f":"'\"\"'!E43","v":18939.742745552998},{"$f":"'\"\"'!F43","v":154468.88008800827},{"$f":"'\"\"'!G43","v":19748594.258140128}]
[{"$f":"'\"\"'!A44","v":7},{"$f":"'\"\"'!B44","v":"2022-03-15"},{"$f":"'\"\"'!C44","v":19748594.258140128},{"$f":"'\"\"'!D44","v":173408.62283356127},{"$f":"'\"\"'!E44","v":34074.575234799559},{"$f":"'\"\"'!F44","v":139334.04759876171},{"$f":"'\"\"'!G44","v":19714519.682905328}]
[{"$f":"'\"\"'!A45","v":8},{"$f":"'\"\"'!B45","v":"2022-04-15"},{"$f":"'\"\"'!C45","v":19714519.682905328},{"$f":"'\"\"'!D45","v":173408.62283356127},{"$f":"'\"\"'!E45","v":19354.011026396096},{"$f":"'\"\"'!F45","v":154054.61180716517},{"$f":"'\"\"'!G45","v":19695165.67187893}]
[{"$f":"'\"\"'!A46","v":9},{"$f":"'\"\"'!B46","v":"2022-05-15"},{"$f":"'\"\"'!C46","v":19695165.67187893},{"$f":"'\"\"'!D46","v":173408.62283356127},{"$f":"'\"\"'!E46","v":24488.594969052152},{"$f":"'\"\"'!F46","v":148920.02786450912},{"$f":"'\"\"'!G46","v":19670677.076909877}]
[{"$f":"'\"\"'!A47","v":10},{"$f":"'\"\"'!B47","v":"2022-06-15"},{"$f":"'\"\"'!C47","v":19670677.076909877},{"$f":"'\"\"'!D47","v":173408.62283356127},{"$f":"'\"\"'!E47","v":19696.609058500326},{"$f":"'\"\"'!F47","v":153712.01377506094},{"$f":"'\"\"'!G47","v":19650980.467851378}]
[{"$f":"'\"\"'!A48","v":11},{"$f":"'\"\"'!B48","v":"2022-07-15"},{"$f":"'\"\"'!C48","v":19650980.467851378},{"$f":"'\"\"'!D48","v":173408.62283356127},{"$f":"'\"\"'!E48","v":24822.690245253732},{"$f":"'\"\"'!F48","v":148585.93258830754},{"$f":"'\"\"'!G48","v":19626157.777606126}]
[{"$f":"'\"\"'!A49","v":12},{"$f":"'\"\"'!B49","v":"2022-08-15"},{"$f":"'\"\"'!C49","v":19626157.777606126},{"$f":"'\"\"'!D49","v":173408.62283356127},{"$f":"'\"\"'!E49","v":20044.494955924107},{"$f":"'\"\"'!F49","v":153364.12787763716},{"$f":"'\"\"'!G49","v":19606113.282650203}]
[{"$f":"'\"\"'!A50","v":13},{"$f":"'\"\"'!B50","v":"2022-09-15"},{"$f":"'\"\"'!C50","v":19606113.282650203},{"$f":"'\"\"'!D50","v":173408.62283356127},{"$f":"'\"\"'!E50","v":20201.128084144992},{"$f":"'\"\"'!F50","v":153207.49474941628},{"$f":"'\"\"'!G50","v":19585912.154566057}]
[{"$f":"'\"\"'!A51","v":14},{"$f":"'\"\"'!B51","v":"2022-10-15"},{"$f":"'\"\"'!C51","v":19585912.154566057},{"$f":"'\"\"'!D51","v":173408.62283356127},{"$f":"'\"\"'!E51","v":25314.687885130523},{"$f":"'\"\"'!F51","v":148093.93494843075},{"$f":"'\"\"'!G51","v":19560597.466680925}]
[{"$f":"'\"\"'!A52","v":15},{"$f":"'\"\"'!B52","v":"2022-11-15"},{"$f":"'\"\"'!C52","v":19560597.466680925},{"$f":"'\"\"'!D52","v":173408.62283356127},{"$f":"'\"\"'!E52","v":20556.801033474505},{"$f":"'\"\"'!F52","v":152851.82180008676},{"$f":"'\"\"'!G52","v":19540040.665647451}]
[{"$f":"'\"\"'!A53","v":16},{"$f":"'\"\"'!B53","v":"2022-12-15"},{"$f":"'\"\"'!C53","v":19540040.665647451},{"$f":"'\"\"'!D53","v":173408.62283356127},{"$f":"'\"\"'!E53","v":25661.533579233976},{"$f":"'\"\"'!F53","v":147747.08925432729},{"$f":"'\"\"'!G53","v":19514379.132068217}]
[{"$f":"'\"\"'!A54","v":17},{"$f":"'\"\"'!B54","v":"2023-01-15"},{"$f":"'\"\"'!C54","v":19514379.132068217},{"$f":"'\"\"'!D54","v":173408.62283356127},{"$f":"'\"\"'!E54","v":20917.963654307125},{"$f":"'\"\"'!F54","v":152490.65917925414},{"$f":"'\"\"'!G54","v":19493461.168413911}]
[{"$f":"'\"\"'!A55","v":18},{"$f":"'\"\"'!B55","v":"2023-02-15"},{"$f":"'\"\"'!C55","v":19493461.168413911},{"$f":"'\"\"'!D55","v":173408.62283356127},{"$f":"'\"\"'!E55","v":21081.422304195235},{"$f":"'\"\"'!F55","v":152327.20052936603},{"$f":"'\"\"'!G55","v":19472379.746109717}]
[{"$f":"'\"\"'!A56","v":19},{"$f":"'\"\"'!B56","v":"2023-03-15"},{"$f":"'\"\"'!C56","v":19472379.746109717},{"$f":"'\"\"'!D56","v":173408.62283356127},{"$f":"'\"\"'!E56","v":36023.376524838241},{"$f":"'\"\"'!F56","v":137385.24630872303},{"$f":"'\"\"'!G56","v":19436356.369584877}]
[{"$f":"'\"\"'!A57","v":20},{"$f":"'\"\"'!B57","v":"2023-04-15"},{"$f":"'\"\"'!C57","v":19436356.369584877},{"$f":"'\"\"'!D57","v":173408.62283356127},{"$f":"'\"\"'!E57","v":21527.654713476863},{"$f":"'\"\"'!F57","v":151880.96812008441},{"$f":"'\"\"'!G57","v":19414828.714871399}]
[{"$f":"'\"\"'!A58","v":21},{"$f":"'\"\"'!B58","v":"2023-05-15"},{"$f":"'\"\"'!C58","v":19414828.714871399},{"$f":"'\"\"'!D58","v":173408.62283356127},{"$f":"'\"\"'!E58","v":26608.292165030638},{"$f":"'\"\"'!F58","v":146800.33066853063},{"$f":"'\"\"'!G58","v":19388220.422706369}]
[{"$f":"'\"\"'!A59","v":22},{"$f":"'\"\"'!B59","v":"2023-06-15"},{"$f":"'\"\"'!C59","v":19388220.422706369},{"$f":"'\"\"'!D59","v":173408.62283356127},{"$f":"'\"\"'!E59","v":21903.802077430621},{"$f":"'\"\"'!F59","v":151504.82075613065},{"$f":"'\"\"'!G59","v":19366316.620628938}]
[{"$f":"'\"\"'!A60","v":23},{"$f":"'\"\"'!B60","v":"2023-07-15"},{"$f":"'\"\"'!C60","v":19366316.620628938},{"$f":"'\"\"'!D60","v":173408.62283356127},{"$f":"'\"\"'!E60","v":26975.10413029723},{"$f":"'\"\"'!F60","v":146433.51870326404},{"$f":"'\"\"'!G60","v":19339341.51649864}]
{"$rows_left_out":280}
{"sheet":"\"\"","index":1,"n_rows":339,"n_cols":7,"rows_kept":339,"cut":false,"hidden":true,"merged":[[32,1,32,2],[28,1,28,2],[29,1,29,2],[17,1,17,2],[31,1,31,2],[30,1,30,2],[21,1,21,2],[22,1,22,2],[23,1,23,2],[25,1,25,3],[26,1,26,2],[27,1,27,2],[20,1,20,2],[14,1,14,3],[15,1,15,2],[16,1,16,2],[18,1,18,2],[19,1,19,2],[9,1,9,2],[10,1,10,2],[11,1,11,2],[1,1,1,3],[3,1,3,2],[4,1,4,2],[5,1,5,2],[7,1,7,2]]}
[null,"Arthur Bergmann Lízing Zrt. - lakáslízing kalkulátor"]
[null,"IGÉNYELT LÍZING PARAMÉTEREI"]
[null,"VISSZLÍZING?",{"$f":"'Lízing kalkuláció'!C3","v":0}]
[null,"Ingatlan vételára",null,{"$f":"'Lízing kalkuláció'!D4","v":30000000}]
[null,"Saját erő%",null,{"$f":"'Lízing kalkuláció'!D5","v":0}]
[null,"Saját erő Ft",null,{"$f":"'Lízing kalkuláció'!D6","v":10000000},{"$f":"IF('Lízing kalkuláció'!D6>0,IF('Lízing kalkuláció'!D5>0,IF(D4*D5=D6,\"\",\"!\"),\"\"),\"\")","v":""}]
[]
[null,"Finanszírozott összeg",null,{"$f":"IF(D5>0,D4-D4*D5,D4-D6)","v":20000000}]
[]
[null,"Futamidő (év)",null,{"$f":"'Lízing kalkuláció'!D10","v":20}]
[null,"Maradványérték %",null,{"$f":"'Lízing kalkuláció'!D11","v":0.1}]
[null,"Maradványérték Ft",null,{"$f":"D8*D11","v":2000000}]
[]
[null,"Arthur Bergmann Lízing Zrt."]
[null,"LAKÁSLÍZING AJÁNLAT PARAMÉTEREI",null,null,"Termékleírásban szereplő korlátok:"]
[null,"Ingatlan vételára",null,{"$f":"MAX($D$4,'kalkulációs feltételek'!$B$20)","v":30000000},"minimum 12.500.000 Ft"]
[null,"Saját erő %",null,{"$f":"IF(C3>0,0,IF(D5=0,IF(D6>0,MAX(D6/D16,'kalkulációs feltételek'!B16),MAX($D$5,'kalkulációs feltételek'!$B$16)),MAX($D$5,'kalkulációs feltételek'!$B$16)))","v":0.33333333333333331},"minimum 30%"]
[null,"Saját erő Ft",null,{"$f":"D16*D17","v":10000000}]
[null,"Lízing finanszírozás összege",null,{"$f":"$D$16*(1-$D$17)","v":20000000.000000004},"minimum 10.000.000 Ft"]
[null,"Maradványérték %",null,{"$f":"MIN('Lízing kalkuláció'!$D$11,VLOOKUP('Lízing kalkuláció'!$D$23,'kalkulációs feltételek'!$A$10:$B$12,2,1))","v":0.1},"10 évig maximum 30%, 15 évig maximum 20%, 20 évig maximum 10%"]
[null,"Maradványérték összege",null,{"$f":"$D$19*$D$20","v":2000000.0000000005}]
[null,"Éves kamatláb*",null,{"$f":"'kalkulációs feltételek'!$B$2+VLOOKUP($D$23,'kalkulációs feltételek'!$A$5:$B$7,2,1)","v":9.1999999999999998E-2},{"$f":"'kalkulációs feltételek'!A2","v":"2021-08-02"},"-án érvényes 1 havi BUBOR alapján"]
[null,"Futamidő években",null,{"$f":"MIN('Lízing kalkuláció'!$D$10,'kalkulációs feltételek'!$B$14)","v":20}]
[null,"Tervezett folyósítás",null,{"$f":"TODAY()+30","v":"2021-09-10"},"ajánlat érvényességi dátuma"]
[]
[null,"LÍZING ÁTTEKINTŐ"]
[null,"Havi lízingdíj",null,{"$f":"D38","v":173408.62283356127},{"$f":"IF(segéd!B3=0,\"\",\"Kalkuláció szükséges!\")","v":"Kalkuláció szükséges!"}]
[null,"Törlesztések száma",null,{"$f":"D23*12","v":240}]
[null,"Kamat összesen",null,{"$f":"VLOOKUP(\"összesen\",$B$38:$F$339,5,0)","v":27110366.236864347}]
[null,"Futamidő alatt megfizetett lízingdíjak összege",null,{"$f":"VLOOKUP(\"összesen\",$B$38:$F$339,3,0)","v":43618069.480054855}]
[null,"Szerződéskötési díj",null,{"$f":"D19*'kalkulációs feltételek'!B22","v":400000.00000000006},"2%, alapja a finanszírozási összeg"]
[null,"Szerződéskötéskor fizetendő illeték",null,{"$f":"D16*'kalkulációs feltételek'!B23","v":600000},"2%, alapja az ingatlan vételára"]
[null,"Ügyvédi díj",null,{"$f":"MAX(D16*'kalkulációs feltételek'!B24,'kalkulációs feltételek'!D24)","v":150000},"0,5%, minimum 100.000 Ft, alapja az ingatlan vételára"]
[]
[]
[]
[null,"Esedékesség dátuma","Nyitó tőketartozás összege","Esedékes lízingdíj (és maradványérték)","Lízingdíj tőkerésze","Lízingdíjban foglalt kamat összege","Záró tőketartozás a befizetést követően"]
[1,{"$f":"VLOOKUP(D24,'kalkulációs feltételek'!$A$27:$B$50,2,1)","v":"2021-09-15"},{"$f":"D19","v":20000000.000000004},{"$f":"'Lízing kalkuláció'!D38","v":173408.62283356127},{"$f":"D38-F38","v":148283.50478361448},{"$f":"C38*((1+'kalkulációs feltételek'!$A$56)^(B38-D24)-1)","v":25125.118049946774},{"$f":"C38-E38","v":19851716.495216388}]
[{"$f":"IF(A38=\"\",\"\",IF(A38+1<=$D$23*12,A38+1,\"\"))","v":2},{"$f":"IF(A39=\"\",IF(A38 = $D$23*12,\"Összesen\",\"\"),EDATE(B38,1))","v":"2021-10-15"},{"$f":"IF($A39=\"\",\"\",G38)","v":19851716.495216388},{"$f":"IF(A39=\"\",IF(A38=\"\",\"\",SUM(D$38:D38)),IF(A39=$D$23*12,D$38+$D$21,D$38))","v":173408.62283356127},{"$f":"IF($A39=\"\",IF($A38=\"\",\"\",SUM(E$38:E38)),D39-F39)","v":23304.875402432139},{"$f":"IF($A39=\"\",IF($A38=\"\",\"\",SUM(F$38:F38)),C39*((1+'kalkulációs feltételek'!$A$56)^(B39-B38)-1))","v":150103.74743112913},{"$f":"IF($A39=\"\",\"\",C39-E39)","v":19828411.619813956}]
[3,"2021-11-15",19828411.619813956,{"$f":"IF(A40=\"\",IF(A39=\"\",\"\",SUM(D$38:D39)),IF(A40=$D$23*12,D$38+$D$21,D$38))","v":173408.62283356127},{"$f":"IF($A40=\"\",IF($A39=\"\",\"\",SUM(E$38:E39)),D40-F40)","v":18464.028495214327},{"$f":"IF($A40=\"\",IF($A39=\"\",\"\",SUM(F$38:F39)),C40*((1+'kalkulációs feltételek'!$A$56)^(B40-B39)-1))","v":154944.59433834694},19809947.591318741]
[4,"2021-12-15",19809947.591318741,{"$f":"IF(A41=\"\",IF(A40=\"\",\"\",SUM(D$38:D40)),IF(A41=$D$23*12,D$38+$D$21,D$38))","v":173408.62283356127},{"$f":"IF($A41=\"\",IF($A40=\"\",\"\",SUM(E$38:E40)),D41-F41)","v":23620.700434622093},{"$f":"IF($A41=\"\",IF($A40=\"\",\"\",SUM(F$38:F40)),C41*((1+'kalkulációs feltételek'!$A$56)^(B41-B40)-1))","v":149787.92239893918},19786326.89088412]
[5,"2022-01-15",19786326.89088412,{"$f":"IF(A42=\"\",IF(A41=\"\",\"\",SUM(D$38:D41)),IF(A42=$D$23*12,D$38+$D$21,D$38))","v":173408.62283356127},{"$f":"IF($A42=\"\",IF($A41=\"\",\"\",SUM(E$38:E41)),D42-F42)","v":18792.889998440165},{"$f":"IF($A42=\"\",IF($A41=\"\",\"\",SUM(F$38:F41)),C42*((1+'kalkulációs feltételek'!$A$56)^(B42-B41)-1))","v":154615.7328351211},19767534.00088568]
[6,"2022-02-15",19767534.00088568,{"$f":"IF(A43=\"\",IF(A42=\"\",\"\",SUM(D$38:D42)),IF(A43=$D$23*12,D$38+$D$21,D$38))","v":173408.62283356127},{"$f":"IF($A43=\"\",IF($A42=\"\",\"\",SUM(E$38:E42)),D43-F43)","v":18939.742745552998},{"$f":"IF($A43=\"\",IF($A42=\"\",\"\",SUM(F$38:F42)),C43*((1+'kalkulációs feltételek'!$A$56)^(B43-B42)-1))","v":154468.88008800827},19748594.258140128]
[7,"2022-03-15",19748594.258140128,{"$f":"IF(A44=\"\",IF(A43=\"\",\"\",SUM(D$38:D43)),IF(A44=$D$23*12,D$38+$D$21,D$38))","v":173408.62283356127},{"$f":"IF($A44=\"\",IF($A43=\"\",\"\",SUM(E$38:E43)),D44-F44)","v":34074.575234799559},{"$f":"IF($A44=\"\",IF($A43=\"\",\"\",SUM(F$38:F43)),C44*((1+'kalkulációs feltételek'!$A$56)^(B44-B43)-1))","v":139334.04759876171},19714519.682905328]
[8,"2022-04-15",19714519.682905328,{"$f":"IF(A45=\"\",IF(A44=\"\",\"\",SUM(D$38:D44)),IF(A45=$D$23*12,D$38+$D$21,D$38))","v":173408.62283356127},{"$f":"IF($A45=\"\",IF($A44=\"\",\"\",SUM(E$38:E44)),D45-F45)","v":19354.011026396096},{"$f":"IF($A45=\"\",IF($A44=\"\",\"\",SUM(F$38:F44)),C45*((1+'kalkulációs feltételek'!$A$56)^(B45-B44)-1))","v":154054.61180716517},19695165.67187893]
[9,"2022-05-15",19695165.67187893,{"$f":"IF(A46=\"\",IF(A45=\"\",\"\",SUM(D$38:D45)),IF(A46=$D$23*12,D$38+$D$21,D$38))","v":173408.62283356127},{"$f":"IF($A46=\"\",IF($A45=\"\",\"\",SUM(E$38:E45)),D46-F46)","v":24488.594969052152},{"$f":"IF($A46=\"\",IF($A45=\"\",\"\",SUM(F$38:F45)),C46*((1+'kalkulációs feltételek'!$A$56)^(B46-B45)-1))","v":148920.02786450912},19670677.076909877]
[10,"2022-06-15",19670677.076909877,{"$f":"IF(A47=\"\",IF(A46=\"\",\"\",SUM(D$38:D46)),IF(A47=$D$23*12,D$38+$D$21,D$38))","v":173408.62283356127},{"$f":"IF($A47=\"\",IF($A46=\"\",\"\",SUM(E$38:E46)),D47-F47)","v":19696.609058500326},{"$f":"IF($A47=\"\",IF($A46=\"\",\"\",SUM(F$38:F46)),C47*((1+'kalkulációs feltételek'!$A$56)^(B47-B46)-1))","v":153712.01377506094},19650980.467851378]
[11,"2022-07-15",19650980.467851378,{"$f":"IF(A48=\"\",IF(A47=\"\",\"\",SUM(D$38:D47)),IF(A48=$D$23*12,D$38+$D$21,D$38))","v":173408.62283356127},{"$f":"IF($A48=\"\",IF($A47=\"\",\"\",SUM(E$38:E47)),D48-F48)","v":24822.690245253732},{"$f":"IF($A48=\"\",IF($A47=\"\",\"\",SUM(F$38:F47)),C48*((1+'kalkulációs feltételek'!$A$56)^(B48-B47)-1))","v":148585.93258830754},19626157.777606126]
[12,"2022-08-15",19626157.777606126,{"$f":"IF(A49=\"\",IF(A48=\"\",\"\",SUM(D$38:D48)),IF(A49=$D$23*12,D$38+$D$21,D$38))","v":173408.62283356127},{"$f":"IF($A49=\"\",IF($A48=\"\",\"\",SUM(E$38:E48)),D49-F49)","v":20044.494955924107},{"$f":"IF($A49=\"\",IF($A48=\"\",\"\",SUM(F$38:F48)),C49*((1+'kalkulációs feltételek'!$A$56)^(B49-B48)-1))","v":153364.12787763716},19606113.282650203]
[13,"2022-09-15",19606113.282650203,{"$f":"IF(A50=\"\",IF(A49=\"\",\"\",SUM(D$38:D49)),IF(A50=$D$23*12,D$38+$D$21,D$38))","v":173408.62283356127},{"$f":"IF($A50=\"\",IF($A49=\"\",\"\",SUM(E$38:E49)),D50-F50)","v":20201.128084144992},{"$f":"IF($A50=\"\",IF($A49=\"\",\"\",SUM(F$38:F49)),C50*((1+'kalkulációs feltételek'!$A$56)^(B50-B49)-1))","v":153207.49474941628},19585912.154566057]
[14,"2022-10-15",19585912.154566057,{"$f":"IF(A51=\"\",IF(A50=\"\",\"\",SUM(D$38:D50)),IF(A51=$D$23*12,D$38+$D$21,D$38))","v":173408.62283356127},{"$f":"IF($A51=\"\",IF($A50=\"\",\"\",SUM(E$38:E50)),D51-F51)","v":25314.687885130523},{"$f":"IF($A51=\"\",IF($A50=\"\",\"\",SUM(F$38:F50)),C51*((1+'kalkulációs feltételek'!$A$56)^(B51-B50)-1))","v":148093.93494843075},19560597.466680925]
[15,"2022-11-15",19560597.466680925,{"$f":"IF(A52=\"\",IF(A51=\"\",\"\",SUM(D$38:D51)),IF(A52=$D$23*12,D$38+$D$21,D$38))","v":173408.62283356127},{"$f":"IF($A52=\"\",IF($A51=\"\",\"\",SUM(E$38:E51)),D52-F52)","v":20556.801033474505},{"$f":"IF($A52=\"\",IF($A51=\"\",\"\",SUM(F$38:F51)),C52*((1+'kalkulációs feltételek'!$A$56)^(B52-B51)-1))","v":152851.82180008676},19540040.665647451]
[16,"2022-12-15",19540040.665647451,{"$f":"IF(A53=\"\",IF(A52=\"\",\"\",SUM(D$38:D52)),IF(A53=$D$23*12,D$38+$D$21,D$38))","v":173408.62283356127},{"$f":"IF($A53=\"\",IF($A52=\"\",\"\",SUM(E$38:E52)),D53-F53)","v":25661.533579233976},{"$f":"IF($A53=\"\",IF($A52=\"\",\"\",SUM(F$38:F52)),C53*((1+'kalkulációs feltételek'!$A$56)^(B53-B52)-1))","v":147747.08925432729},19514379.132068217]
[17,"2023-01-15",19514379.132068217,{"$f":"IF(A54=\"\",IF(A53=\"\",\"\",SUM(D$38:D53)),IF(A54=$D$23*12,D$38+$D$21,D$38))","v":173408.62283356127},{"$f":"IF($A54=\"\",IF($A53=\"\",\"\",SUM(E$38:E53)),D54-F54)","v":20917.963654307125},{"$f":"IF($A54=\"\",IF($A53=\"\",\"\",SUM(F$38:F53)),C54*((1+'kalkulációs feltételek'!$A$56)^(B54-B53)-1))","v":152490.65917925414},19493461.168413911]
[18,"2023-02-15",19493461.168413911,{"$f":"IF(A55=\"\",IF(A54=\"\",\"\",SUM(D$38:D54)),IF(A55=$D$23*12,D$38+$D$21,D$38))","v":173408.62283356127},{"$f":"IF($A55=\"\",IF($A54=\"\",\"\",SUM(E$38:E54)),D55-F55)","v":21081.422304195235},{"$f":"IF($A55=\"\",IF($A54=\"\",\"\",SUM(F$38:F54)),C55*((1+'kalkulációs feltételek'!$A$56)^(B55-B54)-1))","v":152327.20052936603},19472379.746109717]
[19,"2023-03-15",19472379.746109717,{"$f":"IF(A56=\"\",IF(A55=\"\",\"\",SUM(D$38:D55)),IF(A56=$D$23*12,D$38+$D$21,D$38))","v":173408.62283356127},{"$f":"IF($A56=\"\",IF($A55=\"\",\"\",SUM(E$38:E55)),D56-F56)","v":36023.376524838241},{"$f":"IF($A56=\"\",IF($A55=\"\",\"\",SUM(F$38:F55)),C56*((1+'kalkulációs feltételek'!$A$56)^(B56-B55)-1))","v":137385.24630872303},19436356.369584877]
[20,"2023-04-15",19436356.369584877,{"$f":"IF(A57=\"\",IF(A56=\"\",\"\",SUM(D$38:D56)),IF(A57=$D$23*12,D$38+$D$21,D$38))","v":173408.62283356127},{"$f":"IF($A57=\"\",IF($A56=\"\",\"\",SUM(E$38:E56)),D57-F57)","v":21527.654713476863},{"$f":"IF($A57=\"\",IF($A56=\"\",\"\",SUM(F$38:F56)),C57*((1+'kalkulációs feltételek'!$A$56)^(B57-B56)-1))","v":151880.96812008441},19414828.714871399]
[21,"2023-05-15",19414828.714871399,{"$f":"IF(A58=\"\",IF(A57=\"\",\"\",SUM(D$38:D57)),IF(A58=$D$23*12,D$38+$D$21,D$38))","v":173408.62283356127},{"$f":"IF($A58=\"\",IF($A57=\"\",\"\",SUM(E$38:E57)),D58-F58)","v":26608.292165030638},{"$f":"IF($A58=\"\",IF($A57=\"\",\"\",SUM(F$38:F57)),C58*((1+'kalkulációs feltételek'!$A$56)^(B58-B57)-1))","v":146800.33066853063},19388220.422706369]
[22,"2023-06-15",19388220.422706369,{"$f":"IF(A59=\"\",IF(A58=\"\",\"\",SUM(D$38:D58)),IF(A59=$D$23*12,D$38+$D$21,D$38))","v":173408.62283356127},{"$f":"IF($A59=\"\",IF($A58=\"\",\"\",SUM(E$38:E58)),D59-F59)","v":21903.802077430621},{"$f":"IF($A59=\"\",IF($A58=\"\",\"\",SUM(F$38:F58)),C59*((1+'kalkulációs feltételek'!$A$56)^(B59-B58)-1))","v":151504.82075613065},19366316.620628938]
[23,"2023-07-15",19366316.620628938,{"$f":"IF(A60=\"\",IF(A59=\"\",\"\",SUM(D$38:D59)),IF(A60=$D$23*12,D$38+$D$21,D$38))","v":173408.62283356127},{"$f":"IF($A60=\"\",IF($A59=\"\",\"\",SUM(E$38:E59)),D60-F60)","v":26975.10413029723},{"$f":"IF($A60=\"\",IF($A59=\"\",\"\",SUM(F$38:F59)),C60*((1+'kalkulációs feltételek'!$A$56)^(B60-B59)-1))","v":146433.51870326404},19339341.51649864]
{"$rows_left_out":280}
{"sheet":"kalkulációs feltételek","index":2,"n_rows":61,"n_cols":4,"rows_kept":61,"cut":false,"hidden":true,"merged":[]}
["1 havi BUBOR"]
["2021-08-02",1.2E-2,"havonta frissítendő a hónap első napját 2 nappal megelőző értékre"]
[]
["Kamatfelár"]
[0,7.4999999999999997E-2]
[10.1,7.7499999999999999E-2]
[15.1,0.08]
[]
["Maradványérték maximum"]
[0,0.3]
[10.1,0.2]
[15.1,0.1]
[]
["Maximális futamidő",20,"év"]
[]
["Minimum önerő",0.3]
[]
["Minimum finanszírozott összeg",10000000]
[]
["Minimális vételár (kerekítve)",{"$f":"ROUNDUP(C20/1000000,1)*1000000","v":14299999.999999998},{"$f":"B18/(1-B16)","v":14285714.285714287}]
[]
["Szerződéskötési díj",0.02]
["Illték",0.02]
["Ügyvédi díj",5.0000000000000001E-3,"minimum:",100000]
[]
["Tervezett folyósítás","első törlesztés"]
["2021-01-01","2021-02-15"]
["2021-02-15","2021-03-15"]
["2021-03-15","2021-04-15"]
["2021-04-15","2021-05-15"]
["2021-05-15","2021-06-15"]
["2021-06-15","2021-07-15"]
["2021-07-15","2021-08-15"]
["2021-08-15","2021-09-15"]
["2021-09-15","2021-10-15"]
["2021-10-15","2021-11-15"]
["2021-11-15","2021-12-15"]
["2021-12-15","2022-01-15"]
["2022-01-15","2022-02-15"]
["2022-02-15","2022-03-15"]
["2022-03-15","2022-04-15"]
["2022-04-15","2022-05-15"]
["2022-05-15","2022-06-15"]
["2022-06-15","2022-07-15"]
["2022-07-15","2022-08-15"]
["2022-08-15","2022-09-15"]
["2022-09-15","2022-10-15"]
["2022-10-15","2022-11-15"]
["2022-11-15","2022-12-15"]
["2022-12-15","2023-01-15"]
[]
[]
[]
[]
["napi kamatráta"]
[{"$f":"((1+'Lízing kalkuláció'!D22/12)^(12/365))-1","v":2.5112502126911629E-4},"ell:",{"$f":"'Lízing kalkuláció'!D22/12","v":7.6666666666666662E-3}]
[]
[]
["részlet függvény eredménye",{"$f":"PMT(C56,'Lízing kalkuláció'!D23*12,-'Lízing kalkuláció'!D19,'Lízing kalkuláció'!D21)","v":179606.5013151785}]
[]
{"$rows_left_out":2}
{"sheet":"segéd","index":3,"n_rows":3,"n_cols":2,"rows_kept":3,"cut":false,"hidden":true,"merged":[]}
["finanszírozott összeg",{"$f":"'Lízing kalkuláció'!D8","v":20000000}]
["tőketörlesztés összesen",{"$f":"ROUND(SUM('Lízing kalkuláció'!$E$38:$E$339)-VLOOKUP(\"összesen\",'Lízing kalkuláció'!$B$38:$E$339,4,0),0)","v":16507703}]
["eltérés",{"$f":"B1-B2","v":3492297}]